{"text_format":"1","workbook":"xlsx","n_sheets":2,"sheets":["CALENDARIO","DATOS"],"not_rendered":{"charts":0,"images":0,"macros":1,"external_links":0,"defined_names":14,"comments":0,"pivot_tables":0},"unopened":[],"bounds":{"document_bytes":16777216,"sheet_cells":100000,"rows_first":2000,"rows_last":500,"rows_between":2000,"halvings":0,"cell_chars":16384,"cell_head_chars":4096},"cells_cut":0,"cells_raw":0,"read":"whole","date_system":"1900"}

{"sheet":"CALENDARIO","index":0,"n_rows":410,"n_cols":39,"rows_kept":410,"cut":false,"hidden":false,"merged":[[7,0,8,2],[7,4,7,7],[7,14,7,16],[8,35,9,35],[7,8,7,10],[7,17,7,18],[7,20,7,28],[0,38,8,38],[1,9,1,14],[1,30,1,31],[4,30,4,31],[4,4,4,8],[4,10,4,14],[1,21,1,25],[4,21,4,25]]}
[null,null,null,null,null,null,null,null,null,null,null,null,null,null,null,null,null,null,null,null,null,null,null,null,null,null,null,null,null,null,null,null,null,null,null,null,null,null,"Códigos de Actividad:\n1: días no trabajados en el periodo.\n3: días trabajados en el periodo.\n4: días IT (excluidos del pago de la prestación por este sistema).\n5: festivos.\n6: vacaciones anuales retribuidas (excluidas del pago de la prestación)\n"]
[null,"NOMBRE DE LA EMPRESA:  ",null,null,null,null,null,null,"Nº C.C.C.:  ",null,null,null,null,null,null,null,null,null,null,null,"CIF Empresa:  ",null,null,null,null,null,null,null,null,"Día Desde:  "]
[]
[null,null,"Apellidos",null,"Nombre",null,null,null,null,null,"NIF Autorizado"]
[null,"AUTORIZADO CERTIFIC@:  ",null,null,null,null,null,null,null,null,null,null,null,null,null,null,null,null,null,null,"Nº ERTE:  ",null,null,null,null,null,null,null,null,"Día Hasta:  "]
[]
[]
["        DATOS DEL TRABAJADOR",null,null,null,"AÑO",null,null,null,2020,null,null,null,null,null,"MES",null,null,2,null,null,{"$f":"IF(R8<>\"\",VLOOKUP(R8,MES,2),\"\")","v":"Febrero"},null,null,null,null,null,null,null,null,null,null,null,null,null,null,"COEFICIENTE",1]
[null,null,null,{"$f":"IF(ISERROR(VLOOKUP(DATOS!M22,SEMANAS,2)),\"\",VLOOKUP(DATOS!M22,SEMANAS,2))","v":"S"},{"$f":"IF(ISERROR(VLOOKUP(DATOS!N22,SEMANAS,2)),\"\",VLOOKUP(DATOS!N22,SEMANAS,2))","v":"D"},{"$f":"IF(ISERROR(VLOOKUP(DATOS!O22,SEMANAS,2)),\"\",VLOOKUP(DATOS!O22,SEMANAS,2))","v":"L"},{"$f":"IF(ISERROR(VLOOKUP(DATOS!P22,SEMANAS,2)),\"\",VLOOKUP(DATOS!P22,SEMANAS,2))","v":"M"},{"$f":"IF(ISERROR(VLOOKUP(DATOS!Q22,SEMANAS,2)),\"\",VLOOKUP(DATOS!Q22,SEMANAS,2))","v":"X"},{"$f":"IF(ISERROR(VLOOKUP(DATOS!R22,SEMANAS,2)),\"\",VLOOKUP(DATOS!R22,SEMANAS,2))","v":"J"},{"$f":"IF(ISERROR(VLOOKUP(DATOS!S22,SEMANAS,2)),\"\",VLOOKUP(DATOS!S22,SEMANAS,2))","v":"V"},{"$f":"IF(ISERROR(VLOOKUP(DATOS!T22,SEMANAS,2)),\"\",VLOOKUP(DATOS!T22,SEMANAS,2))","v":"S"},{"$f":"IF(ISERROR(VLOOKUP(DATOS!U22,SEMANAS,2)),\"\",VLOOKUP(DATOS!U22,SEMANAS,2))","v":"D"},{"$f":"IF(ISERROR(VLOOKUP(DATOS!V22,SEMANAS,2)),\"\",VLOOKUP(DATOS!V22,SEMANAS,2))","v":"L"},{"$f":"IF(ISERROR(VLOOKUP(DATOS!W22,SEMANAS,2)),\"\",VLOOKUP(DATOS!W22,SEMANAS,2))","v":"M"},{"$f":"IF(ISERROR(VLOOKUP(DATOS!X22,SEMANAS,2)),\"\",VLOOKUP(DATOS!X22,SEMANAS,2))","v":"X"},{"$f":"IF(ISERROR(VLOOKUP(DATOS!Y22,SEMANAS,2)),\"\",VLOOKUP(DATOS!Y22,SEMANAS,2))","v":"J"},{"$f":"IF(ISERROR(VLOOKUP(DATOS!Z22,SEMANAS,2)),\"\",VLOOKUP(DATOS!Z22,SEMANAS,2))","v":"V"},{"$f":"IF(ISERROR(VLOOKUP(DATOS!AA22,SEMANAS,2)),\"\",VLOOKUP(DATOS!AA22,SEMANAS,2))","v":"S"},{"$f":"IF(ISERROR(VLOOKUP(DATOS!AB22,SEMANAS,2)),\"\",VLOOKUP(DATOS!AB22,SEMANAS,2))","v":"D"},{"$f":"IF(ISERROR(VLOOKUP(DATOS!AC22,SEMANAS,2)),\"\",VLOOKUP(DATOS!AC22,SEMANAS,2))","v":"L"},{"$f":"IF(ISERROR(VLOOKUP(DATOS!AD22,SEMANAS,2)),\"\",VLOOKUP(DATOS!AD22,SEMANAS,2))","v":"M"},{"$f":"IF(ISERROR(VLOOKUP(DATOS!AE22,SEMANAS,2)),\"\",VLOOKUP(DATOS!AE22,SEMANAS,2))","v":"X"},{"$f":"IF(ISERROR(VLOOKUP(DATOS!AF22,SEMANAS,2)),\"\",VLOOKUP(DATOS!AF22,SEMANAS,2))","v":"J"},{"$f":"IF(ISERROR(VLOOKUP(DATOS!AG22,SEMANAS,2)),\"\",VLOOKUP(DATOS!AG22,SEMANAS,2))","v":"V"},{"$f":"IF(ISERROR(VLOOKUP(DATOS!AH22,SEMANAS,2)),\"\",VLOOKUP(DATOS!AH22,SEMANAS,2))","v":"S"},{"$f":"IF(ISERROR(VLOOKUP(DATOS!AI22,SEMANAS,2)),\"\",VLOOKUP(DATOS!AI22,SEMANAS,2))","v":"D"},{"$f":"IF(ISERROR(VLOOKUP(DATOS!AJ22,SEMANAS,2)),\"\",VLOOKUP(DATOS!AJ22,SEMANAS,2))","v":"L"},{"$f":"IF(ISERROR(VLOOKUP(DATOS!AK22,SEMANAS,2)),\"\",VLOOKUP(DATOS!AK22,SEMANAS,2))","v":"M"},{"$f":"IF(ISERROR(VLOOKUP(DATOS!AL22,SEMANAS,2)),\"\",VLOOKUP(DATOS!AL22,SEMANAS,2))","v":"X"},{"$f":"IF(ISERROR(VLOOKUP(DATOS!AM22,SEMANAS,2)),\"\",VLOOKUP(DATOS!AM22,SEMANAS,2))","v":"J"},{"$f":"IF(ISERROR(VLOOKUP(DATOS!AN22,SEMANAS,2)),\"\",VLOOKUP(DATOS!AN22,SEMANAS,2))","v":"V"},{"$f":"IF(ISERROR(VLOOKUP(DATOS!AO22,SEMANAS,2)),\"\",VLOOKUP(DATOS!AO22,SEMANAS,2))","v":"S"},{"$f":"IF(ISERROR(VLOOKUP(DATOS!AP22,SEMANAS,2)),\"\",VLOOKUP(DATOS!AP22,SEMANAS,2))","v":""},{"$f":"IF(ISERROR(VLOOKUP(DATOS!AQ22,SEMANAS,2)),\"\",VLOOKUP(DATOS!AQ22,SEMANAS,2))","v":""},null,"Días de no\nActividad"]
["Orden","NIF / NIE","APELLIDOS  Y NOMBRE",{"$f":"IF(DATOS!M23,\"\",DATOS!M20)","v":1},{"$f":"IF(DATOS!N23,\"\",DATOS!N20)","v":2},{"$f":"IF(DATOS!O23,\"\",DATOS!O20)","v":3},{"$f":"IF(DATOS!P23,\"\",DATOS!P20)","v":4},{"$f":"IF(DATOS!Q23,\"\",DATOS!Q20)","v":5},{"$f":"IF(DATOS!R23,\"\",DATOS!R20)","v":6},{"$f":"IF(DATOS!S23,\"\",DATOS!S20)","v":7},{"$f":"IF(DATOS!T23,\"\",DATOS!T20)","v":8},{"$f":"IF(DATOS!U23,\"\",DATOS!U20)","v":9},{"$f":"IF(DATOS!V23,\"\",DATOS!V20)","v":10},{"$f":"IF(DATOS!W23,\"\",DATOS!W20)","v":11},{"$f":"IF(DATOS!X23,\"\",DATOS!X20)","v":12},{"$f":"IF(DATOS!Y23,\"\",DATOS!Y20)","v":13},{"$f":"IF(DATOS!Z23,\"\",DATOS!Z20)","v":14},{"$f":"IF(DATOS!AA23,\"\",DATOS!AA20)","v":15},{"$f":"IF(DATOS!AB23,\"\",DATOS!AB20)","v":16},{"$f":"IF(DATOS!AC23,\"\",DATOS!AC20)","v":17},{"$f":"IF(DATOS!AD23,\"\",DATOS!AD20)","v":18},{"$f":"IF(DATOS!AE23,\"\",DATOS!AE20)","v":19},{"$f":"IF(DATOS!AF23,\"\",DATOS!AF20)","v":20},{"$f":"IF(DATOS!AG23,\"\",DATOS!AG20)","v":21},{"$f":"IF(DATOS!AH23,\"\",DATOS!AH20)","v":22},{"$f":"IF(DATOS!AI23,\"\",DATOS!AI20)","v":23},{"$f":"IF(DATOS!AJ23,\"\",DATOS!AJ20)","v":24},{"$f":"IF(DATOS!AK23,\"\",DATOS!AK20)","v":25},{"$f":"IF(DATOS!AL23,\"\",DATOS!AL20)","v":26},{"$f":"IF(DATOS!AM23,\"\",DATOS!AM20)","v":27},{"$f":"IF(DATOS!AN23,\"\",DATOS!AN20)","v":28},{"$f":"IF(DATOS!AO23,\"\",DATOS!AO20)","v":29},{"$f":"IF(DATOS!AP23,\"\",DATOS!AP20)","v":""},{"$f":"IF(DATOS!AQ23,\"\",DATOS!AQ20)","v":""}]
[1,null,null,null,null,null,null,null,null,null,null,null,null,null,null,null,null,null,null,null,null,null,null,null,null,null,null,null,null,null,null,null,null,null,null,{"$f":"IF(B11=\"\",\"\",COUNTIF(D11:AH11,\"1\")+COUNTIF(D11:AH11,\"x\"))","v":""}]
[2,null,null,null,null,null,null,null,null,null,null,null,null,null,null,null,null,null,null,null,null,null,null,null,null,null,null,null,null,null,null,null,null,null,null,{"$f":"IF(B12=\"\",\"\",COUNTIF(D12:AH12,\"1\")+COUNTIF(D12:AH12,\"x\"))","v":""}]
[3,null,null,null,null,null,null,null,null,null,null,null,null,null,null,null,null,null,null,null,null,null,null,null,null,null,null,null,null,null,null,null,null,null,null,""]
[4,null,null,null,null,null,null,null,null,null,null,null,null,null,null,null,null,null,null,null,null,null,null,null,null,null,null,null,null,null,null,null,null,null,null,""]
[5,null,null,null,null,null,null,null,null,null,null,null,null,null,null,null,null,null,null,null,null,null,null,null,null,null,null,null,null,null,null,null,null,null,null,""]
[6,null,null,null,null,null,null,null,null,null,null,null,null,null,null,null,null,null,null,null,null,null,null,null,null,null,null,null,null,null,null,null,null,null,null,""]
[7,null,null,null,null,null,null,null,null,null,null,null,null,null,null,null,null,null,null,null,null,null,null,null,null,null,null,null,null,null,null,null,null,null,null,""]
[8,null,null,null,null,null,null,null,null,null,null,null,null,null,null,null,null,null,null,null,null,null,null,null,null,null,null,null,null,null,null,null,null,null,null,""]
[9,null,null,null,null,null,null,null,null,null,null,null,null,null,null,null,null,null,null,null,null,null,null,null,null,null,null,null,null,null,null,null,null,null,null,""]
[10,null,null,null,null,null,null,null,null,null,null,null,null,null,null,null,null,null,null,null,null,null,null,null,null,null,null,null,null,null,null,null,null,null,null,""]
[11,null,null,null,null,null,null,null,null,null,null,null,null,null,null,null,null,null,null,null,null,null,null,null,null,null,null,null,null,null,null,null,null,null,null,""]
[12,null,null,null,null,null,null,null,null,null,null,null,null,null,null,null,null,null,null,null,null,null,null,null,null,null,null,null,null,null,null,null,null,null,null,""]
[13,null,null,null,null,null,null,null,null,null,null,null,null,null,null,null,null,null,null,null,null,null,null,null,null,null,null,null,null,null,null,null,null,null,null,""]
[14,null,null,null,null,null,null,null,null,null,null,null,null,null,null,null,null,null,null,null,null,null,null,null,null,null,null,null,null,null,null,null,null,null,null,""]
[15,null,null,null,null,null,null,null,null,null,null,null,null,null,null,null,null,null,null,null,null,null,null,null,null,null,null,null,null,null,null,null,null,null,null,""]
[16,null,null,null,null,null,null,null,null,null,null,null,null,null,null,null,null,null,null,null,null,null,null,null,null,null,null,null,null,null,null,null,null,null,null,""]
[17,null,null,null,null,null,null,null,null,null,null,null,null,null,null,null,null,null,null,null,null,null,null,null,null,null,null,null,null,null,null,null,null,null,null,""]
[18,null,null,null,null,null,null,null,null,null,null,null,null,null,null,null,null,null,null,null,null,null,null,null,null,null,null,null,null,null,null,null,null,null,null,""]
[19,null,null,null,null,null,null,null,null,null,null,null,null,null,null,null,null,null,null,null,null,null,null,null,null,null,null,null,null,null,null,null,null,null,null,""]
[20,null,null,null,null,null,null,null,null,null,null,null,null,null,null,null,null,null,null,null,null,null,null,null,null,null,null,null,null,null,null,null,null,null,null,""]
{"$rows_left_out":381}
{"sheet":"DATOS","index":1,"n_rows":404,"n_cols":53,"rows_kept":404,"cut":false,"hidden":true,"merged":[]}
[null,null,null,null,null,"DNI incorrecto:",{"$f":"VLOOKUP(0,$F$5:$I404,4,FALSE)","v":""},{"$f":"VLOOKUP(G1,A5:H404,8,FALSE)","v":0},null,"DNI repetido:",{"$f":"IF(ISERROR(VLOOKUP(1,$J$5:$K404,2,FALSE)),\"\",VLOOKUP(1,$J$5:$K404,2,FALSE))","v":""},null,"Datos formulario:",null,null,null,"AÑOS",null,"MESES",null,null,"SEMANA",null,"Año:",{"$f":"CALENDARIO!I8","v":2020},null,"dias marcados fuera del mes"]
[null,null,null,null,null,"Verificación trabajadores:",{"$f":"IF(F3=G3,1,0)","v":1},null,null,"Verificación trabajadores:",{"$f":"IF(SUM(J5:J404)>0,0,1)","v":1},null,"Nombre empresa:",{"$f":"TRIM(O2)","v":""},{"$f":"IF(CALENDARIO!C2=\"\",\"\",CALENDARIO!C2)","v":""},{"$f":"LEN(TRIM(O2))","v":0},2014,null,1,"Enero",null,1,"L","Mes:",{"$f":"CALENDARIO!R8","v":2},null,{"$f":"IF(AA3>$Y$3,1,0)","v":0},{"$f":"IF(AB3>$Y$3,1,0)","v":1},{"$f":"IF(AC3>$Y$3,1,0)","v":1}]
[null,null,null,null,null,{"$f":"SUM(F5:F404)","v":0},{"$f":"SUM(G5:G404)","v":0},null,null,null,null,null,"Nº CCC empresa:",{"$f":"TRIM(O3)","v":""},{"$f":"IF(CALENDARIO!J2=\"\",\"\",CALENDARIO!J2)","v":""},{"$f":"LEN(TRIM(O3))","v":0},2015,null,2,"Febrero",null,2,"M","MáximoDiaMes:",{"$f":"DAY(DATE(Y1,Y2+1,1)-1)","v":29},null,29,30,31]
["NIF/NIE","Valor DNI/NIF","Letra NIF","Digitos control NIF","Letra NIF calculada","nº trabajadores con dni correcto","nº trabajadores incluidos",null,"dni","trabajadores repetidos",null,null,"NIF de Empresa:","",{"$f":"IF(CALENDARIO!V2=\"\",\"\",CALENDARIO!V2)","v":""},0,2016,null,3,"Marzo",null,3,"X"]
[{"$f":"IF(CALENDARIO!B11=\"\",\"\",TRIM(UPPER(CALENDARIO!B11)))","v":""},{"$f":"IF(A5=\"\",\"\",IF(OR(UPPER(LEFT(A5))=\"X\",UPPER(LEFT(A5))=\"Y\",UPPER(LEFT(A5))=\"Z\"),MID(A5,2,LEN(A5)-2),LEFT(A5,LEN(A5)-1)))","v":""},{"$f":"IF(A5=\"\",\"\",RIGHT(A5,1))","v":""},{"$f":"IF(A5=\"\",\"\",IF(UPPER(LEFT(A5))=\"Y\",MOD(VALUE(\"1\"&B5),23),IF(UPPER(LEFT(A5))=\"Z\",MOD(VALUE(\"2\"&B5),23),MOD(B5,23))))","v":""},{"$f":"IF(A5=\"\",\"\",MID(\"TRWAGMYFPDXBNJZSQVHLCKE\",D5+1,1))","v":""},{"$f":"IF(AND(A5<>\"\",C5=E5),1,0)","v":0},{"$f":"IF(A5=\"\",0,1)","v":0},{"$f":"IF(A5=\"\",0,H4+1)","v":0},{"$f":"IF(A5=\"\",\"\",A5)","v":""},0,"-",null,"Nombre representante:","",{"$f":"IF(CALENDARIO!E5=\"\",\"\",CALENDARIO!E5)","v":""},0,2017,null,4,"Abril",null,4,"J"]
[{"$f":"IF(CALENDARIO!B12=\"\",\"\",TRIM(UPPER(CALENDARIO!B12)))","v":""},{"$f":"IF(A6=\"\",\"\",IF(OR(UPPER(LEFT(A6))=\"X\",UPPER(LEFT(A6))=\"Y\",UPPER(LEFT(A6))=\"Z\"),MID(A6,2,LEN(A6)-2),LEFT(A6,LEN(A6)-1)))","v":""},{"$f":"IF(A6=\"\",\"\",RIGHT(A6,1))","v":""},{"$f":"IF(A6=\"\",\"\",IF(UPPER(LEFT(A6))=\"Y\",MOD(VALUE(\"1\"&B6),23),IF(UPPER(LEFT(A6))=\"Z\",MOD(VALUE(\"2\"&B6),23),MOD(B6,23))))","v":""},{"$f":"IF(A6=\"\",\"\",MID(\"TRWAGMYFPDXBNJZSQVHLCKE\",D6+1,1))","v":""},{"$f":"IF(AND(A6<>\"\",C6=E6),1,0)","v":0},{"$f":"IF(A6=\"\",0,1)","v":0},{"$f":"IF(A6=\"\",0,H5+1)","v":0},{"$f":"IF(A6=\"\",\"\",A6)","v":""},{"$f":"IF(K6=\"\",0,1)","v":0},{"$f":"IF(OR($A6=\"\",ISERROR(VLOOKUP($A6,$A$5:$B5,2,FALSE))),\"\",VLOOKUP($A6,$A$5:$B5,2,FALSE))","v":""},null,"Apellidos representante:","",{"$f":"IF(CALENDARIO!C5=\"\",\"\",CALENDARIO!C5)","v":""},0,2018,null,5,"Mayo",null,5,"V"]
[{"$f":"IF(CALENDARIO!B13=\"\",\"\",TRIM(UPPER(CALENDARIO!B13)))","v":""},"","","","",0,0,{"$f":"IF(A7=\"\",0,H6+1)","v":0},"",{"$f":"IF(K7=\"\",0,1)","v":0},{"$f":"IF(OR($A7=\"\",ISERROR(VLOOKUP($A7,$A$5:$B6,2,FALSE))),\"\",VLOOKUP($A7,$A$5:$B6,2,FALSE))","v":""},null,"NIF representante:","",{"$f":"IF(CALENDARIO!K5=\"\",\"\",CALENDARIO!K5)","v":""},0,2019,null,6,"Junio",null,6,"S"]
[{"$f":"IF(CALENDARIO!B14=\"\",\"\",TRIM(UPPER(CALENDARIO!B14)))","v":""},"","","","",0,0,0,"",0,{"$f":"IF(OR($A8=\"\",ISERROR(VLOOKUP($A8,$A$5:$B7,2,FALSE))),\"\",VLOOKUP($A8,$A$5:$B7,2,FALSE))","v":""},null,"Nº ERE:","",{"$f":"IF(CALENDARIO!V5=\"\",\"\",CALENDARIO!V5)","v":""},0,2020,null,7,"Julio",null,7,"D"]
[{"$f":"IF(CALENDARIO!B15=\"\",\"\",TRIM(UPPER(CALENDARIO!B15)))","v":""},"","","","",0,0,0,"",0,{"$f":"IF(OR($A9=\"\",ISERROR(VLOOKUP($A9,$A$5:$B8,2,FALSE))),\"\",VLOOKUP($A9,$A$5:$B8,2,FALSE))","v":""},null,"Día desde:","",{"$f":"IF(CALENDARIO!AE2=\"\",\"\",CALENDARIO!AE2)","v":""},0,2021,null,8,"Agosto"]
[{"$f":"IF(CALENDARIO!B16=\"\",\"\",TRIM(UPPER(CALENDARIO!B16)))","v":""},"","","","",0,0,0,"",0,{"$f":"IF(OR($A10=\"\",ISERROR(VLOOKUP($A10,$A$5:$B9,2,FALSE))),\"\",VLOOKUP($A10,$A$5:$B9,2,FALSE))","v":""},null,"Día hasta:","",{"$f":"IF(CALENDARIO!AE5=\"\",\"\",CALENDARIO!AE5)","v":""},0,2022,null,9,"Septiembre"]
[{"$f":"IF(CALENDARIO!B17=\"\",\"\",TRIM(UPPER(CALENDARIO!B17)))","v":""},"","","","",0,0,0,"",0,{"$f":"IF(OR($A11=\"\",ISERROR(VLOOKUP($A11,$A$5:$B10,2,FALSE))),\"\",VLOOKUP($A11,$A$5:$B10,2,FALSE))","v":""},null,null,null,null,null,2023,null,10,"Octubre"]
[{"$f":"IF(CALENDARIO!B18=\"\",\"\",TRIM(UPPER(CALENDARIO!B18)))","v":""},"","","","",0,0,0,"",0,{"$f":"IF(OR($A12=\"\",ISERROR(VLOOKUP($A12,$A$5:$B11,2,FALSE))),\"\",VLOOKUP($A12,$A$5:$B11,2,FALSE))","v":""},null,null,null,"COEFICIENTES",null,2024,null,11,"Noviembre"]
[{"$f":"IF(CALENDARIO!B19=\"\",\"\",TRIM(UPPER(CALENDARIO!B19)))","v":""},"","","","",0,0,0,"",0,{"$f":"IF(OR($A13=\"\",ISERROR(VLOOKUP($A13,$A$5:$B12,2,FALSE))),\"\",VLOOKUP($A13,$A$5:$B12,2,FALSE))","v":""},null,null,null,1,null,2025,null,12,"Diciembre"]
[{"$f":"IF(CALENDARIO!B20=\"\",\"\",TRIM(UPPER(CALENDARIO!B20)))","v":""},"","","","",0,0,0,"",0,{"$f":"IF(OR($A14=\"\",ISERROR(VLOOKUP($A14,$A$5:$B13,2,FALSE))),\"\",VLOOKUP($A14,$A$5:$B13,2,FALSE))","v":""},null,null,null,1.25,null,2026]
[{"$f":"IF(CALENDARIO!B21=\"\",\"\",TRIM(UPPER(CALENDARIO!B21)))","v":""},"","","","",0,0,0,"",0,{"$f":"IF(OR($A15=\"\",ISERROR(VLOOKUP($A15,$A$5:$B14,2,FALSE))),\"\",VLOOKUP($A15,$A$5:$B14,2,FALSE))","v":""}]
[{"$f":"IF(CALENDARIO!B22=\"\",\"\",TRIM(UPPER(CALENDARIO!B22)))","v":""},"","","","",0,0,0,"",0,{"$f":"IF(OR($A16=\"\",ISERROR(VLOOKUP($A16,$A$5:$B15,2,FALSE))),\"\",VLOOKUP($A16,$A$5:$B15,2,FALSE))","v":""}]
[{"$f":"IF(CALENDARIO!B23=\"\",\"\",TRIM(UPPER(CALENDARIO!B23)))","v":""},"","","","",0,0,0,"",0,{"$f":"IF(OR($A17=\"\",ISERROR(VLOOKUP($A17,$A$5:$B16,2,FALSE))),\"\",VLOOKUP($A17,$A$5:$B16,2,FALSE))","v":""}]
[{"$f":"IF(CALENDARIO!B24=\"\",\"\",TRIM(UPPER(CALENDARIO!B24)))","v":""},"","","","",0,0,0,"",0,{"$f":"IF(OR($A18=\"\",ISERROR(VLOOKUP($A18,$A$5:$B17,2,FALSE))),\"\",VLOOKUP($A18,$A$5:$B17,2,FALSE))","v":""}]
[{"$f":"IF(CALENDARIO!B25=\"\",\"\",TRIM(UPPER(CALENDARIO!B25)))","v":""},"","","","",0,0,0,"",0,{"$f":"IF(OR($A19=\"\",ISERROR(VLOOKUP($A19,$A$5:$B18,2,FALSE))),\"\",VLOOKUP($A19,$A$5:$B18,2,FALSE))","v":""},null,"DIAS DEL MES"]
[{"$f":"IF(CALENDARIO!B26=\"\",\"\",TRIM(UPPER(CALENDARIO!B26)))","v":""},"","","","",0,0,0,"",0,{"$f":"IF(OR($A20=\"\",ISERROR(VLOOKUP($A20,$A$5:$B19,2,FALSE))),\"\",VLOOKUP($A20,$A$5:$B19,2,FALSE))","v":""},null,1,2,3,4,5,6,7,8,9,10,11,12,13,14,15,16,17,18,19,20,21,22,23,24,25,26,27,28,29,30,31]
[{"$f":"IF(CALENDARIO!B27=\"\",\"\",TRIM(UPPER(CALENDARIO!B27)))","v":""},"","","","",0,0,0,"",0,{"$f":"IF(OR($A21=\"\",ISERROR(VLOOKUP($A21,$A$5:$B20,2,FALSE))),\"\",VLOOKUP($A21,$A$5:$B20,2,FALSE))","v":""},null,{"$f":"VALUE(CONCATENATE(M20,\"/\",CALENDARIO!$R$8,\"/\",CALENDARIO!$I$8))","v":"2020-02-01"},{"$f":"VALUE(CONCATENATE(N20,\"/\",CALENDARIO!$R$8,\"/\",CALENDARIO!$I$8))","v":"2020-02-02"},{"$f":"VALUE(CONCATENATE(O20,\"/\",CALENDARIO!$R$8,\"/\",CALENDARIO!$I$8))","v":"2020-02-03"},{"$f":"VALUE(CONCATENATE(P20,\"/\",CALENDARIO!$R$8,\"/\",CALENDARIO!$I$8))","v":"2020-02-04"},{"$f":"VALUE(CONCATENATE(Q20,\"/\",CALENDARIO!$R$8,\"/\",CALENDARIO!$I$8))","v":"2020-02-05"},{"$f":"VALUE(CONCATENATE(R20,\"/\",CALENDARIO!$R$8,\"/\",CALENDARIO!$I$8))","v":"2020-02-06"},{"$f":"VALUE(CONCATENATE(S20,\"/\",CALENDARIO!$R$8,\"/\",CALENDARIO!$I$8))","v":"2020-02-07"},{"$f":"VALUE(CONCATENATE(T20,\"/\",CALENDARIO!$R$8,\"/\",CALENDARIO!$I$8))","v":"2020-02-08"},{"$f":"VALUE(CONCATENATE(U20,\"/\",CALENDARIO!$R$8,\"/\",CALENDARIO!$I$8))","v":"2020-02-09"},{"$f":"VALUE(CONCATENATE(V20,\"/\",CALENDARIO!$R$8,\"/\",CALENDARIO!$I$8))","v":"2020-02-10"},{"$f":"VALUE(CONCATENATE(W20,\"/\",CALENDARIO!$R$8,\"/\",CALENDARIO!$I$8))","v":"2020-02-11"},{"$f":"VALUE(CONCATENATE(X20,\"/\",CALENDARIO!$R$8,\"/\",CALENDARIO!$I$8))","v":"2020-02-12"},{"$f":"VALUE(CONCATENATE(Y20,\"/\",CALENDARIO!$R$8,\"/\",CALENDARIO!$I$8))","v":"2020-02-13"},{"$f":"VALUE(CONCATENATE(Z20,\"/\",CALENDARIO!$R$8,\"/\",CALENDARIO!$I$8))","v":"2020-02-14"},{"$f":"VALUE(CONCATENATE(AA20,\"/\",CALENDARIO!$R$8,\"/\",CALENDARIO!$I$8))","v":"2020-02-15"},{"$f":"VALUE(CONCATENATE(AB20,\"/\",CALENDARIO!$R$8,\"/\",CALENDARIO!$I$8))","v":"2020-02-16"},{"$f":"VALUE(CONCATENATE(AC20,\"/\",CALENDARIO!$R$8,\"/\",CALENDARIO!$I$8))","v":"2020-02-17"},{"$f":"VALUE(CONCATENATE(AD20,\"/\",CALENDARIO!$R$8,\"/\",CALENDARIO!$I$8))","v":"2020-02-18"},{"$f":"VALUE(CONCATENATE(AE20,\"/\",CALENDARIO!$R$8,\"/\",CALENDARIO!$I$8))","v":"2020-02-19"},{"$f":"VALUE(CONCATENATE(AF20,\"/\",CALENDARIO!$R$8,\"/\",CALENDARIO!$I$8))","v":"2020-02-20"},{"$f":"VALUE(CONCATENATE(AG20,\"/\",CALENDARIO!$R$8,\"/\",CALENDARIO!$I$8))","v":"2020-02-21"},{"$f":"VALUE(CONCATENATE(AH20,\"/\",CALENDARIO!$R$8,\"/\",CALENDARIO!$I$8))","v":"2020-02-22"},{"$f":"VALUE(CONCATENATE(AI20,\"/\",CALENDARIO!$R$8,\"/\",CALENDARIO!$I$8))","v":"2020-02-23"},{"$f":"VALUE(CONCATENATE(AJ20,\"/\",CALENDARIO!$R$8,\"/\",CALENDARIO!$I$8))","v":"2020-02-24"},{"$f":"VALUE(CONCATENATE(AK20,\"/\",CALENDARIO!$R$8,\"/\",CALENDARIO!$I$8))","v":"2020-02-25"},{"$f":"VALUE(CONCATENATE(AL20,\"/\",CALENDARIO!$R$8,\"/\",CALENDARIO!$I$8))","v":"2020-02-26"},{"$f":"VALUE(CONCATENATE(AM20,\"/\",CALENDARIO!$R$8,\"/\",CALENDARIO!$I$8))","v":"2020-02-27"},{"$f":"VALUE(CONCATENATE(AN20,\"/\",CALENDARIO!$R$8,\"/\",CALENDARIO!$I$8))","v":"2020-02-28"},{"$f":"VALUE(CONCATENATE(AO20,\"/\",CALENDARIO!$R$8,\"/\",CALENDARIO!$I$8))","v":"2020-02-29"},{"$f":"VALUE(CONCATENATE(AP20,\"/\",CALENDARIO!$R$8,\"/\",CALENDARIO!$I$8))","v":{"$error":"#VALUE!"}},{"$f":"VALUE(CONCATENATE(AQ20,\"/\",CALENDARIO!$R$8,\"/\",CALENDARIO!$I$8))","v":{"$error":"#VALUE!"}}]
[{"$f":"IF(CALENDARIO!B28=\"\",\"\",TRIM(UPPER(CALENDARIO!B28)))","v":""},"","","","",0,0,0,"",0,{"$f":"IF(OR($A22=\"\",ISERROR(VLOOKUP($A22,$A$5:$B21,2,FALSE))),\"\",VLOOKUP($A22,$A$5:$B21,2,FALSE))","v":""},null,{"$f":"IF(ISERROR(WEEKDAY(M21,2)),\"\",WEEKDAY(M21,2))","v":6},{"$f":"IF(ISERROR(WEEKDAY(N21,2)),\"\",WEEKDAY(N21,2))","v":7},{"$f":"IF(ISERROR(WEEKDAY(O21,2)),\"\",WEEKDAY(O21,2))","v":1},2,3,4,5,6,7,1,2,3,4,5,6,7,1,2,3,4,5,6,7,1,2,3,4,5,6,"",""]
[{"$f":"IF(CALENDARIO!B29=\"\",\"\",TRIM(UPPER(CALENDARIO!B29)))","v":""},"","","","",0,0,0,"",0,{"$f":"IF(OR($A23=\"\",ISERROR(VLOOKUP($A23,$A$5:$B22,2,FALSE))),\"\",VLOOKUP($A23,$A$5:$B22,2,FALSE))","v":""},null,null,{"$f":"ISERROR(N21)","v":false},false,false,false,false,false,false,false,false,false,false,false,false,false,false,false,false,false,false,false,false,false,false,false,false,false,false,false,true,{"$f":"ISERROR(AQ21)","v":true}]
[{"$f":"IF(CALENDARIO!B30=\"\",\"\",TRIM(UPPER(CALENDARIO!B30)))","v":""},"","","","",0,0,0,"",0,{"$f":"IF(OR($A24=\"\",ISERROR(VLOOKUP($A24,$A$5:$B23,2,FALSE))),\"\",VLOOKUP($A24,$A$5:$B23,2,FALSE))","v":""},null,{"$f":"IF(M23,0,1)","v":1},{"$f":"IF(N23,0,1)","v":1},1,1,1,1,1,1,1,1,1,1,1,1,1,1,1,1,1,1,1,1,1,1,1,1,1,1,1,0,0]
[{"$f":"IF(CALENDARIO!B31=\"\",\"\",TRIM(UPPER(CALENDARIO!B31)))","v":""},"","","","",0,0,0,"",0,{"$f":"IF(OR($A25=\"\",ISERROR(VLOOKUP($A25,$A$5:$B24,2,FALSE))),\"\",VLOOKUP($A25,$A$5:$B24,2,FALSE))","v":""}]
[{"$f":"IF(CALENDARIO!B32=\"\",\"\",TRIM(UPPER(CALENDARIO!B32)))","v":""},"","","","",0,0,0,"",0,{"$f":"IF(OR($A26=\"\",ISERROR(VLOOKUP($A26,$A$5:$B25,2,FALSE))),\"\",VLOOKUP($A26,$A$5:$B25,2,FALSE))","v":""},null,"CCC","provincia","nº empresa","DC.texto",null,null,null,null,"verificación CCC"]
[{"$f":"IF(CALENDARIO!B33=\"\",\"\",TRIM(UPPER(CALENDARIO!B33)))","v":""},"","","","",0,0,0,"",0,{"$f":"IF(OR($A27=\"\",ISERROR(VLOOKUP($A27,$A$5:$B26,2,FALSE))),\"\",VLOOKUP($A27,$A$5:$B26,2,FALSE))","v":""},null,{"$f":"O3","v":""},{"$f":"LEFT(O3,2)","v":""},{"$f":"MID(O3,3,7)","v":""},{"$f":"RIGHT(O3,2)","v":""},null,null,null,null,{"$f":"IF(P27=T29,1,0)","v":0}]
[{"$f":"IF(CALENDARIO!B34=\"\",\"\",TRIM(UPPER(CALENDARIO!B34)))","v":""},"","","","",0,0,0,"",0,{"$f":"IF(OR($A28=\"\",ISERROR(VLOOKUP($A28,$A$5:$B27,2,FALSE))),\"\",VLOOKUP($A28,$A$5:$B27,2,FALSE))","v":""},null,null,"provincia","provincia valor","naf","naf valor","prov+naf","DC","DC texto"]
[{"$f":"IF(CALENDARIO!B35=\"\",\"\",TRIM(UPPER(CALENDARIO!B35)))","v":""},"","","","",0,0,0,"",0,{"$f":"IF(OR($A29=\"\",ISERROR(VLOOKUP($A29,$A$5:$B28,2,FALSE))),\"\",VLOOKUP($A29,$A$5:$B28,2,FALSE))","v":""},null,"calculo CCC",{"$f":"TEXT(N27,\"00\")","v":""},{"$f":"IF(N29=\"\",0,VALUE(N29))","v":0},{"$f":"TEXT(O27,\"0000000\")","v":""},{"$f":"IF(P29=\"\",0,VALUE(P29))","v":0},{"$f":"IF(Q29>=1000000,O29*10000000+Q29,O29*1000000+Q29)","v":0},{"$f":"MOD(R29,97)","v":0},{"$f":"CONCATENATE(REPT(0,2-LEN(S29)),S29)","v":"00"}]
[{"$f":"IF(CALENDARIO!B36=\"\",\"\",TRIM(UPPER(CALENDARIO!B36)))","v":""},"","","","",0,0,0,"",0,{"$f":"IF(OR($A30=\"\",ISERROR(VLOOKUP($A30,$A$5:$B29,2,FALSE))),\"\",VLOOKUP($A30,$A$5:$B29,2,FALSE))","v":""},null,null,null,null,null,null,null,null,null,null,null,null,null,null,null,null,null,null,null,null,null,null,null,null,null,null,null,null,null,null,null,null,null,null,null,null,null,null,null,null,null,"para marcar"]
{"$rows_left_out":374}